码迷,mamicode.com
首页 >  
搜索关键字:failure    ( 1020个结果
Junit4测试报错
1、字符串数组越界 java.lang.String IndexOutOfBounds Exception:String index out of range:-1 导致: Transaction rolled back because it has been marked as rollback- ...
分类:其他好文   时间:2019-02-15 13:30:54    阅读次数:8
haproxy 无法启动,需要添加内核参数
haproxy
分类:其他好文   时间:2019-02-13 10:54:12    阅读次数:9
C++写文件
头文件 ofstream 向文件写内容 实现代码 include include include include using std::ofstream; void CMFCyaraguiDlg::C2ToYaraText(vector result) { ofstream outfile; //输 ...
分类:编程语言   时间:2019-02-08 20:03:23    阅读次数:13
continuous random formula
2. The hazard or failure rate function of a non-negative continuous random variable X isdefined to bewhere f(x) is the pdf of X and F(x) is its cdf. W ...
分类:其他好文   时间:2019-02-03 19:51:42    阅读次数:23
安卓真机或者模拟器运行安装应用时提示 Failure [INSTALL_FAILED_NO_MATCHING_ABIS: Failed to extract native libraries, res=-113]解决办法
有时候为了方便调试APP,会在电脑上开启模拟器来调试我们的代码,有时候会出现 Failure [INSTALL_FAILED_NO_MATCHING_ABIS: Failed to extract native libraries, res=-113]这样的报错提示,经过查询后得知,这可能是因为AP ...
分类:移动开发   时间:2019-01-31 22:51:37    阅读次数:39
Failure to transfer org.apache.maven:maven-archiver:pom:2.5 from https://repo.maven.apache.org/maven2 was cached in the local repository, resolution will not be reattempted until the update interval o
pom.xml报错: Failure to transfer org.apache.maven:maven-archiver:pom:2.5 from https://repo.maven.apache.org/maven2 was cached in the local repository, r ...
分类:Web程序   时间:2019-01-31 16:49:06    阅读次数:30
Cloudera Manager 常见异常
1. Cloudera Management Service服务全部无法启动 观察到的现象: (1)cm service 组件无法启动,启动时服务请求超时终止;(2)主机信息也无法获取到,一直提示“无法与服务端取得联系”(3)cm-server日志中提示“Authentication failure ...
分类:其他好文   时间:2019-01-29 11:54:30    阅读次数:20
zabbix报错整理--持续更新
遇到第一个问题:发送邮件报错: Failure when receiving data from the peer 报错内容:从对等端接收数据时失败(即从邮件接收端接收数据失败) 可能原因:邮件smtp服务出问题;或者接收邮件的邮箱smtp服务挂了 解决过程:先调试手动触发邮件,如果收不到,则更改邮 ...
分类:其他好文   时间:2019-01-28 13:45:44    阅读次数:25
java.util.zip.ZipException: duplicate entry: com/tencent/mm/a/a.class
这个问题吊不起微信支付,最终发现是后台接口给我传的appid不正确,传成另一个app的id了 错误日志: FAILURE: Build failed with an exception. * What went wrong:Execution failed for task ':app:transf ...
分类:编程语言   时间:2019-01-27 19:28:38    阅读次数:31
ADB安装apk失败总结
通过adb命令安装应用过程: 常见问题以及原因: Failure [INSTALL_FAILED_ALREADY_EXISTS]:应用已经存在,需要卸载设备中现有的。 :没有找到设备,查看是否开启调试,或者数据线有问题 Failure [INSTALL_FAILED_UPDATE_INCOMPATI ...
分类:数据库   时间:2019-01-25 18:42:26    阅读次数:34
1020条   1 2 3 4 ... 102 下一页
© 2014 mamicode.com 版权所有 京ICP备13008772号-2
迷上了代码!