码迷,mamicode.com
首页 > 其他好文 > 详细

pinpoint 安装指南

时间:2019-09-22 23:14:01      阅读:26      评论:0      收藏:0      [点我收藏+]

标签:core   manager   enc   源码   generate   force   maven   cts   reactor   


[email protected] MINGW64 /c/Developer
$ git clone https://github.com/naver/pinpoint.git
Cloning into pinpoint...
remote: Enumerating objects: 51, done.
remote: Counting objects: 100% (51/51), done.
remote: Compressing objects: 100% (23/23), done.
remote: Total 226792 (delta 29), reused 42 (delta 28), pack-reused 226741
Receiving objects: 100% (226792/226792), 216.10 MiB | 148.00 KiB/s, done.
Resolving deltas: 100% (118494/118494), done.
Checking out files: 100% (9186/9186), done.

[email protected] MINGW64 /c/Developer
$ cd pinpoint/


[email protected] MINGW64 /c/Developer/pinpoint (master)
$

[email protected] MINGW64 /c/Developer/pinpoint (master)
$ cd hbase/

[email protected] MINGW64 /c/Developer/pinpoint/hbase (master)
$ ls
hbase-schema/             hbase-schema-manager/  pom.xml
hbase-schema-definition/  hbase-site.xml         scripts/

[email protected] MINGW64 /c/Developer/pinpoint/hbase (master)
$ mvc package
bash: mvc: command not found

[email protected] MINGW64 /c/Developer/pinpoint/hbase (master)
$ mvn package
[WARNING]
[WARNING] Some problems were encountered while building the effective settings
[WARNING] expected START_TAG or END_TAG not TEXT (position: TEXT seen ...</passw                                                                                            ord>\u13\n    </... @143:7)  @ C:\Developer\tools\build\apache-maven-3.3.9\conf\                                                                                            settings.xml, line 143, column 7
[WARNING]
[INFO] Scanning for projects...
[INFO] ------------------------------------------------------------------------
[INFO] Reactor Build Order:
[INFO]
[INFO] pinpoint-hbase-distribution
[INFO] pinpoint-hbase-schema-definition
[INFO] pinpoint-hbase-schema
[INFO] pinpoint-hbase-schema-manager
[INFO]
[INFO] ------------------------------------------------------------------------
[INFO] Building pinpoint-hbase-distribution 1.9.0-SNAPSHOT
[INFO] ------------------------------------------------------------------------
Downloading: http://repo1.maven.org/maven2/org/codehaus/mojo/animal-sniffer-mave                                                                                            n-plugin/1.17/animal-sniffer-maven-plugin-1.17.pom
Downloaded: http://repo1.maven.org/maven2/org/codehaus/mojo/animal-sniffer-maven                                                                                            -plugin/1.17/animal-sniffer-maven-plugin-1.17.pom (6 KB at 5.4 KB/sec)
Downloading: http://repo1.maven.org/maven2/org/codehaus/mojo/animal-sniffer-mave                                                                                            n-plugin/1.17/animal-sniffer-maven-plugin-1.17.jar
Downloaded: http://repo1.maven.org/maven2/org/codehaus/mojo/animal-sniffer-maven-plugin/1.17/animal-sniffer-maven-plugin-1.17.jar                                            (34 KB at 4.6 KB/sec)
[INFO]
[INFO] --- maven-enforcer-plugin:3.0.0-M2:enforce (enforce-pinpoint-build-requirements) @ pinpoint-hbase ---
[WARNING] Rule 0: org.apache.maven.plugins.enforcer.RequireMavenVersion failed with message:
Detected Maven Version: 3.3.9 is not in the allowed range 3.5.
[WARNING] Rule 3: org.apache.maven.plugins.enforcer.RequireEnvironmentVariable failed with message:
Environment variable "JAVA_6_HOME" is required for this build.
[WARNING] Rule 4: org.apache.maven.plugins.enforcer.RequireEnvironmentVariable failed with message:
Environment variable "JAVA_7_HOME" is required for this build.
[WARNING] Rule 5: org.apache.maven.plugins.enforcer.RequireEnvironmentVariable failed with message:
Environment variable "JAVA_8_HOME" is required for this build.
[WARNING] Rule 6: org.apache.maven.plugins.enforcer.RequireEnvironmentVariable failed with message:
Environment variable "JAVA_9_HOME" is required for this build.
[INFO] ------------------------------------------------------------------------
[INFO] Reactor Summary:
[INFO]
[INFO] pinpoint-hbase-distribution ........................ FAILURE [ 10.146 s]
[INFO] pinpoint-hbase-schema-definition ................... SKIPPED
[INFO] pinpoint-hbase-schema .............................. SKIPPED
[INFO] pinpoint-hbase-schema-manager ...................... SKIPPED
[INFO] ------------------------------------------------------------------------
[INFO] BUILD FAILURE
[INFO] ------------------------------------------------------------------------
[INFO] Total time: 10.859 s
[INFO] Finished at: 2019-09-22T22:07:17+08:00
[INFO] Final Memory: 16M/155M
[INFO] ------------------------------------------------------------------------
[ERROR] Failed to execute goal org.apache.maven.plugins:maven-enforcer-plugin:3.0.0-M2:enforce (enforce-pinpoint-build-req                                                  uirements) on project pinpoint-hbase: Some Enforcer rules have failed. Look above for specific messages explaining why the                                                   rule failed. -> [Help 1]
[ERROR]
[ERROR] To see the full stack trace of the errors, re-run Maven with the -e switch.
[ERROR] Re-run Maven using the -X switch to enable full debug logging.
[ERROR]
[ERROR] For more information about the errors and possible solutions, please read the following articles:
[ERROR] [Help 1] http://cwiki.apache.org/confluence/display/MAVEN/MojoExecutionException

[email protected] MINGW64 /c/Developer/pinpoint/hbase (master)
$

[email protected] MINGW64 /c/Developer/pinpoint/hbase (master)
$ mvn package -e
[INFO] Error stacktraces are turned on.
[WARNING]
[WARNING] Some problems were encountered while building the effective settings
[WARNING] expected START_TAG or END_TAG not TEXT (position: TEXT seen ...</password>\u13\n    </... @143:7)  @ C:\Developer\tools\build\apache-m                            aven-3.3.9\conf\settings.xml, line 143, column 7
[WARNING]
[INFO] Scanning for projects...
[INFO] ------------------------------------------------------------------------
[INFO] Reactor Build Order:
[INFO]
[INFO] pinpoint-hbase-distribution
[INFO] pinpoint-hbase-schema-definition
[INFO] pinpoint-hbase-schema
[INFO] pinpoint-hbase-schema-manager
[INFO]
[INFO] ------------------------------------------------------------------------
[INFO] Building pinpoint-hbase-distribution 1.9.0-SNAPSHOT
[INFO] ------------------------------------------------------------------------
[INFO]
[INFO] --- maven-enforcer-plugin:3.0.0-M2:enforce (enforce-pinpoint-build-requirements) @ pinpoint-hbase ---
[WARNING] Rule 0: org.apache.maven.plugins.enforcer.RequireMavenVersion failed with message:
Detected Maven Version: 3.3.9 is not in the allowed range 3.5.
[WARNING] Rule 3: org.apache.maven.plugins.enforcer.RequireEnvironmentVariable failed with message:
Environment variable "JAVA_6_HOME" is required for this build.
[WARNING] Rule 4: org.apache.maven.plugins.enforcer.RequireEnvironmentVariable failed with message:
Environment variable "JAVA_7_HOME" is required for this build.
[WARNING] Rule 5: org.apache.maven.plugins.enforcer.RequireEnvironmentVariable failed with message:
Environment variable "JAVA_8_HOME" is required for this build.
[WARNING] Rule 6: org.apache.maven.plugins.enforcer.RequireEnvironmentVariable failed with message:
Environment variable "JAVA_9_HOME" is required for this build.
[INFO] ------------------------------------------------------------------------
[INFO] Reactor Summary:
[INFO]
[INFO] pinpoint-hbase-distribution ........................ FAILURE [  0.973 s]
[INFO] pinpoint-hbase-schema-definition ................... SKIPPED
[INFO] pinpoint-hbase-schema .............................. SKIPPED
[INFO] pinpoint-hbase-schema-manager ...................... SKIPPED
[INFO] ------------------------------------------------------------------------
[INFO] BUILD FAILURE
[INFO] ------------------------------------------------------------------------
[INFO] Total time: 1.655 s
[INFO] Finished at: 2019-09-22T22:07:46+08:00
[INFO] Final Memory: 13M/155M
[INFO] ------------------------------------------------------------------------
[ERROR] Failed to execute goal org.apache.maven.plugins:maven-enforcer-plugin:3.0.0-M2:enforce (enforce-pinpoint-build-requirements) on project                             pinpoint-hbase: Some Enforcer rules have failed. Look above for specific messages explaining why the rule failed. -> [Help 1]
org.apache.maven.lifecycle.LifecycleExecutionException: Failed to execute goal org.apache.maven.plugins:maven-enforcer-plugin:3.0.0-M2:enforce (                            enforce-pinpoint-build-requirements) on project pinpoint-hbase: Some Enforcer rules have failed. Look above for specific messages explaining why                             the rule failed.
        at org.apache.maven.lifecycle.internal.MojoExecutor.execute(MojoExecutor.java:212)
        at org.apache.maven.lifecycle.internal.MojoExecutor.execute(MojoExecutor.java:153)
        at org.apache.maven.lifecycle.internal.MojoExecutor.execute(MojoExecutor.java:145)
        at org.apache.maven.lifecycle.internal.LifecycleModuleBuilder.buildProject(LifecycleModuleBuilder.java:116)
        at org.apache.maven.lifecycle.internal.LifecycleModuleBuilder.buildProject(LifecycleModuleBuilder.java:80)
        at org.apache.maven.lifecycle.internal.builder.singlethreaded.SingleThreadedBuilder.build(SingleThreadedBuilder.java:51)
        at org.apache.maven.lifecycle.internal.LifecycleStarter.execute(LifecycleStarter.java:128)
        at org.apache.maven.DefaultMaven.doExecute(DefaultMaven.java:307)
        at org.apache.maven.DefaultMaven.doExecute(DefaultMaven.java:193)
        at org.apache.maven.DefaultMaven.execute(DefaultMaven.java:106)
        at org.apache.maven.cli.MavenCli.execute(MavenCli.java:863)
        at org.apache.maven.cli.MavenCli.doMain(MavenCli.java:288)
        at org.apache.maven.cli.MavenCli.main(MavenCli.java:199)
        at sun.reflect.NativeMethodAccessorImpl.invoke0(Native Method)
        at sun.reflect.NativeMethodAccessorImpl.invoke(NativeMethodAccessorImpl.java:62)
        at sun.reflect.DelegatingMethodAccessorImpl.invoke(DelegatingMethodAccessorImpl.java:43)
        at java.lang.reflect.Method.invoke(Method.java:498)
        at org.codehaus.plexus.classworlds.launcher.Launcher.launchEnhanced(Launcher.java:289)
        at org.codehaus.plexus.classworlds.launcher.Launcher.launch(Launcher.java:229)
        at org.codehaus.plexus.classworlds.launcher.Launcher.mainWithExitCode(Launcher.java:415)
        at org.codehaus.plexus.classworlds.launcher.Launcher.main(Launcher.java:356)
Caused by: org.apache.maven.plugin.MojoExecutionException: Some Enforcer rules have failed. Look above for specific messages explaining why the                             rule failed.
        at org.apache.maven.plugins.enforcer.EnforceMojo.execute(EnforceMojo.java:235)
        at org.apache.maven.plugin.DefaultBuildPluginManager.executeMojo(DefaultBuildPluginManager.java:134)
        at org.apache.maven.lifecycle.internal.MojoExecutor.execute(MojoExecutor.java:207)
        ... 20 more
[ERROR]
[ERROR] Re-run Maven using the -X switch to enable full debug logging.
[ERROR]
[ERROR] For more information about the errors and possible solutions, please read the following articles:
[ERROR] [Help 1] http://cwiki.apache.org/confluence/display/MAVEN/MojoExecutionException

[email protected] MINGW64 /c/Developer/pinpoint/hbase (master)
$

[email protected] MINGW64 /c/Developer/pinpoint/hbase (master)
$

[email protected] MINGW64 /c/Developer/pinpoint/hbase (master)
$ pwd
/c/Developer/pinpoint/hbase

[email protected] MINGW64 /c/Developer/pinpoint/hbase (master)
$ ls
hbase-schema/  hbase-schema-definition/  hbase-schema-manager/  hbase-site.xml  pom.xml  scripts/

[email protected] MINGW64 /c/Developer/pinpoint/hbase (master)
$ mvn package -e -X
Apache Maven 3.3.9 (bb52d8502b132ec0a5a3f4c09453c07478323dc5; 2015-11-11T00:41:47+08:00)
Maven home: C:\Developer\tools\build\apache-maven-3.3.9
Java version: 1.8.0_111, vendor: Oracle Corporation
Java home: C:\Program Files\Java\jdk1.8.0_111\jre
Default locale: en_US, platform encoding: GBK
OS name: "windows 10", version: "10.0", arch: "amd64", family: "dos"
[DEBUG] Created new class realm maven.api
[DEBUG] Importing foreign packages into class realm maven.api
[DEBUG]   Imported: javax.enterprise.inject.* < plexus.core
[DEBUG]   Imported: javax.enterprise.util.* < plexus.core
[DEBUG]   Imported: javax.inject.* < plexus.core
[DEBUG]   Imported: org.apache.maven.* < plexus.core
[DEBUG]   Imported: org.apache.maven.artifact < plexus.core
[DEBUG]   Imported: org.apache.maven.classrealm < plexus.core
[DEBUG]   Imported: org.apache.maven.cli < plexus.core
[DEBUG]   Imported: org.apache.maven.configuration < plexus.core
[DEBUG]   Imported: org.apache.maven.exception < plexus.core
[DEBUG]   Imported: org.apache.maven.execution < plexus.core
[DEBUG]   Imported: org.apache.maven.execution.scope < plexus.core
[DEBUG]   Imported: org.apache.maven.lifecycle < plexus.core
[DEBUG]   Imported: org.apache.maven.model < plexus.core
[DEBUG]   Imported: org.apache.maven.monitor < plexus.core
[DEBUG]   Imported: org.apache.maven.plugin < plexus.core
[DEBUG]   Imported: org.apache.maven.profiles < plexus.core
[DEBUG]   Imported: org.apache.maven.project < plexus.core
[DEBUG]   Imported: org.apache.maven.reporting < plexus.core
[DEBUG]   Imported: org.apache.maven.repository < plexus.core
[DEBUG]   Imported: org.apache.maven.rtinfo < plexus.core
[DEBUG]   Imported: org.apache.maven.settings < plexus.core
[DEBUG]   Imported: org.apache.maven.toolchain < plexus.core
[DEBUG]   Imported: org.apache.maven.usability < plexus.core
[DEBUG]   Imported: org.apache.maven.wagon.* < plexus.core
[DEBUG]   Imported: org.apache.maven.wagon.authentication < plexus.core
[DEBUG]   Imported: org.apache.maven.wagon.authorization < plexus.core
[DEBUG]   Imported: org.apache.maven.wagon.events < plexus.core
[DEBUG]   Imported: org.apache.maven.wagon.observers < plexus.core
[DEBUG]   Imported: org.apache.maven.wagon.proxy < plexus.core
[DEBUG]   Imported: org.apache.maven.wagon.repository < plexus.core
[DEBUG]   Imported: org.apache.maven.wagon.resource < plexus.core
[DEBUG]   Imported: org.codehaus.classworlds < plexus.core
[DEBUG]   Imported: org.codehaus.plexus.* < plexus.core
[DEBUG]   Imported: org.codehaus.plexus.classworlds < plexus.core
[DEBUG]   Imported: org.codehaus.plexus.component < plexus.core
[DEBUG]   Imported: org.codehaus.plexus.configuration < plexus.core
[DEBUG]   Imported: org.codehaus.plexus.container < plexus.core
[DEBUG]   Imported: org.codehaus.plexus.context < plexus.core
[DEBUG]   Imported: org.codehaus.plexus.lifecycle < plexus.core
[DEBUG]   Imported: org.codehaus.plexus.logging < plexus.core
[DEBUG]   Imported: org.codehaus.plexus.personality < plexus.core
[DEBUG]   Imported: org.codehaus.plexus.util.xml.Xpp3Dom < plexus.core
[DEBUG]   Imported: org.codehaus.plexus.util.xml.pull.XmlPullParser < plexus.core
[DEBUG]   Imported: org.codehaus.plexus.util.xml.pull.XmlPullParserException < plexus.core
[DEBUG]   Imported: org.codehaus.plexus.util.xml.pull.XmlSerializer < plexus.core
[DEBUG]   Imported: org.eclipse.aether.* < plexus.core
[DEBUG]   Imported: org.eclipse.aether.artifact < plexus.core
[DEBUG]   Imported: org.eclipse.aether.collection < plexus.core
[DEBUG]   Imported: org.eclipse.aether.deployment < plexus.core
[DEBUG]   Imported: org.eclipse.aether.graph < plexus.core
[DEBUG]   Imported: org.eclipse.aether.impl < plexus.core
[DEBUG]   Imported: org.eclipse.aether.installation < plexus.core
[DEBUG]   Imported: org.eclipse.aether.internal.impl < plexus.core
[DEBUG]   Imported: org.eclipse.aether.metadata < plexus.core
[DEBUG]   Imported: org.eclipse.aether.repository < plexus.core
[DEBUG]   Imported: org.eclipse.aether.resolution < plexus.core
[DEBUG]   Imported: org.eclipse.aether.spi < plexus.core
[DEBUG]   Imported: org.eclipse.aether.transfer < plexus.core
[DEBUG]   Imported: org.eclipse.aether.version < plexus.core
[DEBUG]   Imported: org.slf4j.* < plexus.core
[DEBUG]   Imported: org.slf4j.helpers.* < plexus.core
[DEBUG]   Imported: org.slf4j.spi.* < plexus.core
[DEBUG] Populating class realm maven.api
[INFO] Error stacktraces are turned on.
[DEBUG] Reading global settings from C:\Developer\tools\build\apache-maven-3.3.9\conf\settings.xml
[DEBUG] Reading user settings from C:\Users\tangcheng\.m2\settings.xml
[WARNING]
[WARNING] Some problems were encountered while building the effective settings
[WARNING] expected START_TAG or END_TAG not TEXT (position: TEXT seen ...</password>\u13\n    </... @143:7)  @ C:\Developer\tools\build\apache-maven-3.3.9\conf\settings.xml, line 143, column 7
[WARNING]
[DEBUG] Reading global toolchains from C:\Developer\tools\build\apache-maven-3.3.9\conf\toolchains.xml
[DEBUG] Reading user toolchains from C:\Users\tangcheng\.m2\toolchains.xml
[DEBUG] Using local repository at C:\Users\tangcheng\.m2\repository
[DEBUG] Using manager EnhancedLocalRepositoryManager with priority 10.0 for C:\Users\tangcheng\.m2\repository
[INFO] Scanning for projects...
[DEBUG] Extension realms for project com.navercorp.pinpoint:pinpoint-hbase:pom:1.9.0-SNAPSHOT: (none)
[DEBUG] Looking up lifecyle mappings for packaging pom from ClassRealm[plexus.core, parent: null]
[DEBUG] Extension realms for project com.navercorp.pinpoint:pinpoint:pom:1.9.0-SNAPSHOT: (none)
[DEBUG] Looking up lifecyle mappings for packaging pom from ClassRealm[plexus.core, parent: null]
[DEBUG] Extension realms for project com.navercorp.pinpoint:pinpoint-hbase-schema:jar:1.9.0-SNAPSHOT: (none)
[DEBUG] Looking up lifecyle mappings for packaging jar from ClassRealm[plexus.core, parent: null]
[DEBUG] Extension realms for project com.navercorp.pinpoint:pinpoint-hbase-schema-manager:jar:1.9.0-SNAPSHOT: (none)
[DEBUG] Looking up lifecyle mappings for packaging jar from ClassRealm[plexus.core, parent: null]
[DEBUG] Extension realms for project com.navercorp.pinpoint:pinpoint-hbase-schema-definition:jar:1.9.0-SNAPSHOT: (none)
[DEBUG] Looking up lifecyle mappings for packaging jar from ClassRealm[plexus.core, parent: null]
[INFO] ------------------------------------------------------------------------
[INFO] Reactor Build Order:
[INFO]
[INFO] pinpoint-hbase-distribution
[INFO] pinpoint-hbase-schema-definition
[INFO] pinpoint-hbase-schema
[INFO] pinpoint-hbase-schema-manager
[DEBUG] === REACTOR BUILD PLAN ================================================
[DEBUG] Project: com.navercorp.pinpoint:pinpoint-hbase:pom:1.9.0-SNAPSHOT
[DEBUG] Tasks:   [package]
[DEBUG] Style:   Regular
[DEBUG] -----------------------------------------------------------------------
[DEBUG] Project: com.navercorp.pinpoint:pinpoint-hbase-schema-definition:jar:1.9.0-SNAPSHOT
[DEBUG] Tasks:   [package]
[DEBUG] Style:   Regular
[DEBUG] -----------------------------------------------------------------------
[DEBUG] Project: com.navercorp.pinpoint:pinpoint-hbase-schema:jar:1.9.0-SNAPSHOT
[DEBUG] Tasks:   [package]
[DEBUG] Style:   Regular
[DEBUG] -----------------------------------------------------------------------
[DEBUG] Project: com.navercorp.pinpoint:pinpoint-hbase-schema-manager:jar:1.9.0-SNAPSHOT
[DEBUG] Tasks:   [package]
[DEBUG] Style:   Regular
[DEBUG] =======================================================================
[INFO]
[INFO] ------------------------------------------------------------------------
[INFO] Building pinpoint-hbase-distribution 1.9.0-SNAPSHOT
[INFO] ------------------------------------------------------------------------
[DEBUG] Lifecycle default -> [validate, initialize, generate-sources, process-sources, generate-resources, process-resources, compile, process-classes, generate-test-sources, process-test-sources, generate-test-resources, process-test-resources, test-compile, process-test-classes, test, prepare-package, package, pre-integration-test, integration-test, post-integration-test, verify, install, deploy]
[DEBUG] Lifecycle clean -> [pre-clean, clean, post-clean]
[DEBUG] Lifecycle site -> [pre-site, site, post-site, site-deploy]
[DEBUG] Lifecycle default -> [validate, initialize, generate-sources, process-sources, generate-resources, process-resources, compile, process-classes, generate-test-sources, process-test-sources, generate-test-resources, process-test-resources, test-compile, process-test-classes, test, prepare-package, package, pre-integration-test, integration-test, post-integration-test, verify, install, deploy]
[DEBUG] Lifecycle clean -> [pre-clean, clean, post-clean]
[DEBUG] Lifecycle site -> [pre-site, site, post-site, site-deploy]
[DEBUG] Lifecycle default -> [validate, initialize, generate-sources, process-sources, generate-resources, process-resources, compile, process-classes, generate-test-sources, process-test-sources, generate-test-resources, process-test-resources, test-compile, process-test-classes, test, prepare-package, package, pre-integration-test, integration-test, post-integration-test, verify, install, deploy]
[DEBUG] Lifecycle clean -> [pre-clean, clean, post-clean]
[DEBUG] Lifecycle site -> [pre-site, site, post-site, site-deploy]
[DEBUG] === PROJECT BUILD PLAN ================================================
[DEBUG] Project:       com.navercorp.pinpoint:pinpoint-hbase:1.9.0-SNAPSHOT
[DEBUG] Dependencies (collect): [test]
[DEBUG] Dependencies (resolve): [compile]
[DEBUG] Repositories (dependencies): [cloudera (https://repository.cloudera.com/artifactory/cloudera-repos/, default, releases+snapshots), spring-maven-repository (http://maven.springframework.org/release/, default, releases+snapshots), spring-maven-release-remote (http://repo.spring.io/libs-release-remote/, default, releases+snapshots), bintray (http://jcenter.bintray.com, default, releases+snapshots), jboss-3rd-party-releases (https://repository.jboss.org/nexus/content/repositories/thirdparty-releases/, default, releases+snapshots), central (https://repo.maven.apache.org/maven2, default, releases)]
[DEBUG] Repositories (plugins)     : [central (http://repo1.maven.org/maven2/, default, releases+snapshots)]
[DEBUG] -----------------------------------------------------------------------
[DEBUG] Goal:          org.apache.maven.plugins:maven-enforcer-plugin:3.0.0-M2:enforce (enforce-pinpoint-build-requirements)
[DEBUG] Style:         Regular
[DEBUG] Configuration: <?xml version="1.0" encoding="UTF-8"?>
<configuration>
  <fail default-value="true">true</fail>
  <failFast default-value="false">${enforcer.failFast}</failFast>
  <ignoreCache default-value="false">${enforcer.ignoreCache}</ignoreCache>
  <mojoExecution default-value="${mojoExecution}"/>
  <project default-value="${project}"/>
  <rules>
    <requireMavenVersion>
      <version>3.5</version>
    </requireMavenVersion>
    <requireJavaVersion>
      <version>1.8</version>
    </requireJavaVersion>
    <requireEnvironmentVariable>
      <variableName>JAVA_HOME</variableName>
    </requireEnvironmentVariable>
    <requireEnvironmentVariable>
      <variableName>JAVA_6_HOME</variableName>
    </requireEnvironmentVariable>
    <requireEnvironmentVariable>
      <variableName>JAVA_7_HOME</variableName>
    </requireEnvironmentVariable>
    <requireEnvironmentVariable>
      <variableName>JAVA_8_HOME</variableName>
    </requireEnvironmentVariable>
    <requireEnvironmentVariable>
      <variableName>JAVA_9_HOME</variableName>
    </requireEnvironmentVariable>
  </rules>
  <session default-value="${session}"/>
  <skip default-value="false">${enforcer.skip}</skip>
</configuration>
[DEBUG] -----------------------------------------------------------------------
[DEBUG] Goal:          org.codehaus.mojo:animal-sniffer-maven-plugin:1.17:check (ensure-java-1.8-class-library)
[DEBUG] Style:         Regular
[DEBUG] Configuration: <?xml version="1.0" encoding="UTF-8"?>
<configuration>
  <failOnError default-value="true">${animal.sniffer.failOnError}</failOnError>
  <ignoreDependencies default-value="true"/>
  <ignores>
    <ignore>sun.*</ignore>
  </ignores>
  <localRepository default-value="${localRepository}"/>
  <outputDirectory default-value="${project.build.outputDirectory}"/>
  <project default-value="${project}"/>
  <signature>
    <groupId>org.codehaus.mojo.signature</groupId>
    <artifactId>java18</artifactId>
    <version>1.0</version>${animal.sniffer.signature}</signature>
  <skip default-value="false">${animal.sniffer.skip}</skip>
</configuration>
[DEBUG] =======================================================================
[DEBUG] Dependency collection stats: {ConflictMarker.analyzeTime=0, ConflictMarker.markTime=0, ConflictMarker.nodeCount=9, ConflictIdSorter.graphTime=16, ConflictIdSorter.topsortTime=0, ConflictIdSorter.conflictIdCount=7, ConflictIdSorter.conflictIdCycleCount=0, ConflictResolver.totalTime=0, ConflictResolver.conflictItemCount=8, DefaultDependencyCollector.collectTime=117, DefaultDependencyCollector.transformTime=16}
[DEBUG] com.navercorp.pinpoint:pinpoint-hbase:pom:1.9.0-SNAPSHOT
[DEBUG]    junit:junit:jar:4.12:test
[DEBUG]       org.hamcrest:hamcrest-core:jar:1.3:test
[DEBUG]    org.hamcrest:hamcrest-library:jar:1.3:test
[DEBUG]    org.mockito:mockito-core:jar:2.7.22:test
[DEBUG]       net.bytebuddy:byte-buddy:jar:1.6.11:test
[DEBUG]       net.bytebuddy:byte-buddy-agent:jar:1.6.11:test
[DEBUG]       org.objenesis:objenesis:jar:2.5:test
[INFO]
[INFO] --- maven-enforcer-plugin:3.0.0-M2:enforce (enforce-pinpoint-build-requirements) @ pinpoint-hbase ---
[DEBUG] Dependency collection stats: {ConflictMarker.analyzeTime=16, ConflictMarker.markTime=0, ConflictMarker.nodeCount=96, ConflictIdSorter.graphTime=0, ConflictIdSorter.topsortTime=0, ConflictIdSorter.conflictIdCount=39, ConflictIdSorter.conflictIdCycleCount=0, ConflictResolver.totalTime=0, ConflictResolver.conflictItemCount=95, DefaultDependencyCollector.collectTime=467, DefaultDependencyCollector.transformTime=16}
[DEBUG] org.apache.maven.plugins:maven-enforcer-plugin:jar:3.0.0-M2:
[DEBUG]    org.apache.maven:maven-artifact:jar:3.0:compile
[DEBUG]    org.apache.maven:maven-plugin-api:jar:3.0:compile
[DEBUG]       org.apache.maven:maven-model:jar:3.0:compile
[DEBUG]       org.sonatype.sisu:sisu-inject-plexus:jar:1.4.2:compile
[DEBUG]          org.sonatype.sisu:sisu-inject-bean:jar:1.4.2:compile
[DEBUG]             org.sonatype.sisu:sisu-guice:jar:noaop:2.1.7:compile
[DEBUG]    org.apache.maven:maven-core:jar:3.0:compile
[DEBUG]       org.apache.maven:maven-settings:jar:3.0:compile
[DEBUG]       org.apache.maven:maven-settings-builder:jar:3.0:compile
[DEBUG]       org.apache.maven:maven-repository-metadata:jar:3.0:compile
[DEBUG]       org.apache.maven:maven-model-builder:jar:3.0:compile
[DEBUG]       org.apache.maven:maven-aether-provider:jar:3.0:runtime
[DEBUG]       org.sonatype.aether:aether-impl:jar:1.7:compile
[DEBUG]          org.sonatype.aether:aether-spi:jar:1.7:compile
[DEBUG]       org.sonatype.aether:aether-api:jar:1.7:compile
[DEBUG]       org.sonatype.aether:aether-util:jar:1.7:compile
[DEBUG]       org.codehaus.plexus:plexus-interpolation:jar:1.14:compile
[DEBUG]       org.codehaus.plexus:plexus-classworlds:jar:2.2.3:compile
[DEBUG]       org.codehaus.plexus:plexus-component-annotations:jar:1.7.1:compile
[DEBUG]       org.sonatype.plexus:plexus-sec-dispatcher:jar:1.3:compile
[DEBUG]          org.sonatype.plexus:plexus-cipher:jar:1.4:compile
[DEBUG]    org.codehaus.plexus:plexus-utils:jar:3.1.0:compile
[DEBUG]    org.apache.maven.enforcer:enforcer-api:jar:3.0.0-M2:compile
[DEBUG]       org.codehaus.plexus:plexus-container-default:jar:1.0-alpha-9:compile
[DEBUG]          junit:junit:jar:4.11:compile
[DEBUG]             org.hamcrest:hamcrest-core:jar:1.3:compile
[DEBUG]          classworlds:classworlds:jar:1.1-alpha-2:compile
[DEBUG]    org.apache.maven.enforcer:enforcer-rules:jar:3.0.0-M2:compile
[DEBUG]       org.apache.maven.shared:maven-common-artifact-filters:jar:3.0.1:compile
[DEBUG]          org.apache.maven.shared:maven-shared-utils:jar:3.1.0:compile
[DEBUG]             commons-io:commons-io:jar:2.5:compile
[DEBUG]       org.apache.commons:commons-lang3:jar:3.5:compile
[DEBUG]       commons-codec:commons-codec:jar:1.6:compile
[DEBUG]       org.beanshell:bsh:jar:2.0b4:compile
[DEBUG]       org.apache.maven.shared:maven-dependency-tree:jar:2.2:compile
[DEBUG]          org.eclipse.aether:aether-util:jar:0.9.0.M2:compile
[DEBUG]       org.apache.maven:maven-compat:jar:3.0:compile
[DEBUG]          org.apache.maven.wagon:wagon-provider-api:jar:1.0-beta-6:compile
[DEBUG] Created new class realm plugin>org.apache.maven.plugins:maven-enforcer-plugin:3.0.0-M2
[DEBUG] Importing foreign packages into class realm plugin>org.apache.maven.plugins:maven-enforcer-plugin:3.0.0-M2
[DEBUG]   Imported:  < maven.api
[DEBUG] Populating class realm plugin>org.apache.maven.plugins:maven-enforcer-plugin:3.0.0-M2
[DEBUG]   Included: org.apache.maven.plugins:maven-enforcer-plugin:jar:3.0.0-M2
[DEBUG]   Included: org.sonatype.sisu:sisu-inject-bean:jar:1.4.2
[DEBUG]   Included: org.sonatype.sisu:sisu-guice:jar:noaop:2.1.7
[DEBUG]   Included: org.sonatype.aether:aether-util:jar:1.7
[DEBUG]   Included: org.codehaus.plexus:plexus-interpolation:jar:1.14
[DEBUG]   Included: org.codehaus.plexus:plexus-component-annotations:jar:1.7.1
[DEBUG]   Included: org.sonatype.plexus:plexus-sec-dispatcher:jar:1.3
[DEBUG]   Included: org.sonatype.plexus:plexus-cipher:jar:1.4
[DEBUG]   Included: org.codehaus.plexus:plexus-utils:jar:3.1.0
[DEBUG]   Included: org.apache.maven.enforcer:enforcer-api:jar:3.0.0-M2
[DEBUG]   Included: junit:junit:jar:4.11
[DEBUG]   Included: org.hamcrest:hamcrest-core:jar:1.3
[DEBUG]   Included: org.apache.maven.enforcer:enforcer-rules:jar:3.0.0-M2
[DEBUG]   Included: org.apache.maven.shared:maven-common-artifact-filters:jar:3.0.1
[DEBUG]   Included: org.apache.maven.shared:maven-shared-utils:jar:3.1.0
[DEBUG]   Included: commons-io:commons-io:jar:2.5
[DEBUG]   Included: org.apache.commons:commons-lang3:jar:3.5
[DEBUG]   Included: commons-codec:commons-codec:jar:1.6
[DEBUG]   Included: org.beanshell:bsh:jar:2.0b4
[DEBUG]   Included: org.apache.maven.shared:maven-dependency-tree:jar:2.2
[DEBUG]   Included: org.eclipse.aether:aether-util:jar:0.9.0.M2
[DEBUG] Configuring mojo org.apache.maven.plugins:maven-enforcer-plugin:3.0.0-M2:enforce from plugin realm ClassRealm[plugin>org.apache.maven.plugins:maven-enforcer-plugin:3.0.0-M2, parent: [email protected]]
[DEBUG] Configuring mojo org.apache.maven.plugins:maven-enforcer-plugin:3.0.0-M2:enforce with basic configurator -->
[DEBUG]   (s) fail = true
[DEBUG]   (s) failFast = false
[DEBUG]   (f) ignoreCache = false
[DEBUG]   (f) mojoExecution = org.apache.maven.plugins:maven-enforcer-plugin:3.0.0-M2:enforce {execution: enforce-pinpoint-build-requirements}
[DEBUG]   (s) project = MavenProject: com.navercorp.pinpoint:pinpoint-hbase:1.9.0-SNAPSHOT @ C:\Developer\pinpoint\hbase\pom.xml
[DEBUG]   (s) version = 3.5
[DEBUG]   (s) version = 1.8
[DEBUG]   (s) variableName = JAVA_HOME
[DEBUG]   (s) variableName = JAVA_6_HOME
[DEBUG]   (s) variableName = JAVA_7_HOME
[DEBUG]   (s) variableName = JAVA_8_HOME
[DEBUG]   (s) variableName = JAVA_9_HOME
[DEBUG]   (s) rules = [[email protected], [email protected], [email protected]8b721, [email protected]a20d6, [email protected]524c3, [email protected]2b546, [email protected]94740]
[DEBUG]   (s) session = [email protected]
[DEBUG]   (s) skip = false
[DEBUG] -- end configuration --
[DEBUG] Executing rule: org.apache.maven.plugins.enforcer.RequireMavenVersion
[DEBUG] Rule org.apache.maven.plugins.enforcer.RequireMavenVersion is cacheable.
[DEBUG] Detected Maven Version: 3.3.9
[DEBUG] Adding failure due to exception
org.apache.maven.enforcer.rule.api.EnforcerRuleException: Detected Maven Version: 3.3.9 is not in the allowed range 3.5.
        at org.apache.maven.plugins.enforcer.AbstractVersionEnforcer.enforceVersion(AbstractVersionEnforcer.java:106)
        at org.apache.maven.plugins.enforcer.RequireMavenVersion.execute(RequireMavenVersion.java:47)
        at org.apache.maven.plugins.enforcer.EnforceMojo.execute(EnforceMojo.java:194)
        at org.apache.maven.plugin.DefaultBuildPluginManager.executeMojo(DefaultBuildPluginManager.java:134)
        at org.apache.maven.lifecycle.internal.MojoExecutor.execute(MojoExecutor.java:207)
        at org.apache.maven.lifecycle.internal.MojoExecutor.execute(MojoExecutor.java:153)
        at org.apache.maven.lifecycle.internal.MojoExecutor.execute(MojoExecutor.java:145)
        at org.apache.maven.lifecycle.internal.LifecycleModuleBuilder.buildProject(LifecycleModuleBuilder.java:116)
        at org.apache.maven.lifecycle.internal.LifecycleModuleBuilder.buildProject(LifecycleModuleBuilder.java:80)
        at org.apache.maven.lifecycle.internal.builder.singlethreaded.SingleThreadedBuilder.build(SingleThreadedBuilder.java:51)
        at org.apache.maven.lifecycle.internal.LifecycleStarter.execute(LifecycleStarter.java:128)
        at org.apache.maven.DefaultMaven.doExecute(DefaultMaven.java:307)
        at org.apache.maven.DefaultMaven.doExecute(DefaultMaven.java:193)
        at org.apache.maven.DefaultMaven.execute(DefaultMaven.java:106)
        at org.apache.maven.cli.MavenCli.execute(MavenCli.java:863)
        at org.apache.maven.cli.MavenCli.doMain(MavenCli.java:288)
        at org.apache.maven.cli.MavenCli.main(MavenCli.java:199)
        at sun.reflect.NativeMethodAccessorImpl.invoke0(Native Method)
        at sun.reflect.NativeMethodAccessorImpl.invoke(NativeMethodAccessorImpl.java:62)
        at sun.reflect.DelegatingMethodAccessorImpl.invoke(DelegatingMethodAccessorImpl.java:43)
        at java.lang.reflect.Method.invoke(Method.java:498)
        at org.codehaus.plexus.classworlds.launcher.Launcher.launchEnhanced(Launcher.java:289)
        at org.codehaus.plexus.classworlds.launcher.Launcher.launch(Launcher.java:229)
        at org.codehaus.plexus.classworlds.launcher.Launcher.mainWithExitCode(Launcher.java:415)
        at org.codehaus.plexus.classworlds.launcher.Launcher.main(Launcher.java:356)
[DEBUG] Executing rule: org.apache.maven.plugins.enforcer.RequireJavaVersion
[DEBUG] Rule org.apache.maven.plugins.enforcer.RequireJavaVersion is cacheable.
[DEBUG] Detected Java String: 1.8.0_111
[DEBUG] Normalized Java String: 1.8.0-111
[DEBUG] Parsed Version: Major: 1 Minor: 8 Incremental: 0 Build: 111 Qualifier: null
[DEBUG] Detected JDK Version: 1.8.0-111 is allowed in the range 1.8.
[DEBUG] Executing rule: org.apache.maven.plugins.enforcer.RequireEnvironmentVariable
[DEBUG] Rule org.apache.maven.plugins.enforcer.RequireEnvironmentVariable is cacheable.
[DEBUG] Executing rule: org.apache.maven.plugins.enforcer.RequireEnvironmentVariable
[DEBUG] Rule org.apache.maven.plugins.enforcer.RequireEnvironmentVariable is cacheable.
[DEBUG] Adding failure due to exception
org.apache.maven.enforcer.rule.api.EnforcerRuleException: Environment variable "JAVA_6_HOME" is required for this build.
        at org.apache.maven.plugins.enforcer.AbstractPropertyEnforcerRule.execute(AbstractPropertyEnforcerRule.java:111)
        at org.apache.maven.plugins.enforcer.EnforceMojo.execute(EnforceMojo.java:194)
        at org.apache.maven.plugin.DefaultBuildPluginManager.executeMojo(DefaultBuildPluginManager.java:134)
        at org.apache.maven.lifecycle.internal.MojoExecutor.execute(MojoExecutor.java:207)
        at org.apache.maven.lifecycle.internal.MojoExecutor.execute(MojoExecutor.java:153)
        at org.apache.maven.lifecycle.internal.MojoExecutor.execute(MojoExecutor.java:145)
        at org.apache.maven.lifecycle.internal.LifecycleModuleBuilder.buildProject(LifecycleModuleBuilder.java:116)
        at org.apache.maven.lifecycle.internal.LifecycleModuleBuilder.buildProject(LifecycleModuleBuilder.java:80)
        at org.apache.maven.lifecycle.internal.builder.singlethreaded.SingleThreadedBuilder.build(SingleThreadedBuilder.java:51)
        at org.apache.maven.lifecycle.internal.LifecycleStarter.execute(LifecycleStarter.java:128)
        at org.apache.maven.DefaultMaven.doExecute(DefaultMaven.java:307)
        at org.apache.maven.DefaultMaven.doExecute(DefaultMaven.java:193)
        at org.apache.maven.DefaultMaven.execute(DefaultMaven.java:106)
        at org.apache.maven.cli.MavenCli.execute(MavenCli.java:863)
        at org.apache.maven.cli.MavenCli.doMain(MavenCli.java:288)
        at org.apache.maven.cli.MavenCli.main(MavenCli.java:199)
        at sun.reflect.NativeMethodAccessorImpl.invoke0(Native Method)
        at sun.reflect.NativeMethodAccessorImpl.invoke(NativeMethodAccessorImpl.java:62)
        at sun.reflect.DelegatingMethodAccessorImpl.invoke(DelegatingMethodAccessorImpl.java:43)
        at java.lang.reflect.Method.invoke(Method.java:498)
        at org.codehaus.plexus.classworlds.launcher.Launcher.launchEnhanced(Launcher.java:289)
        at org.codehaus.plexus.classworlds.launcher.Launcher.launch(Launcher.java:229)
        at org.codehaus.plexus.classworlds.launcher.Launcher.mainWithExitCode(Launcher.java:415)
        at org.codehaus.plexus.classworlds.launcher.Launcher.main(Launcher.java:356)
[DEBUG] Executing rule: org.apache.maven.plugins.enforcer.RequireEnvironmentVariable
[DEBUG] Rule org.apache.maven.plugins.enforcer.RequireEnvironmentVariable is cacheable.
[DEBUG] Adding failure due to exception
org.apache.maven.enforcer.rule.api.EnforcerRuleException: Environment variable "JAVA_7_HOME" is required for this build.
        at org.apache.maven.plugins.enforcer.AbstractPropertyEnforcerRule.execute(AbstractPropertyEnforcerRule.java:111)
        at org.apache.maven.plugins.enforcer.EnforceMojo.execute(EnforceMojo.java:194)
        at org.apache.maven.plugin.DefaultBuildPluginManager.executeMojo(DefaultBuildPluginManager.java:134)
        at org.apache.maven.lifecycle.internal.MojoExecutor.execute(MojoExecutor.java:207)
        at org.apache.maven.lifecycle.internal.MojoExecutor.execute(MojoExecutor.java:153)
        at org.apache.maven.lifecycle.internal.MojoExecutor.execute(MojoExecutor.java:145)
        at org.apache.maven.lifecycle.internal.LifecycleModuleBuilder.buildProject(LifecycleModuleBuilder.java:116)
        at org.apache.maven.lifecycle.internal.LifecycleModuleBuilder.buildProject(LifecycleModuleBuilder.java:80)
        at org.apache.maven.lifecycle.internal.builder.singlethreaded.SingleThreadedBuilder.build(SingleThreadedBuilder.java:51)
        at org.apache.maven.lifecycle.internal.LifecycleStarter.execute(LifecycleStarter.java:128)
        at org.apache.maven.DefaultMaven.doExecute(DefaultMaven.java:307)
        at org.apache.maven.DefaultMaven.doExecute(DefaultMaven.java:193)
        at org.apache.maven.DefaultMaven.execute(DefaultMaven.java:106)
        at org.apache.maven.cli.MavenCli.execute(MavenCli.java:863)
        at org.apache.maven.cli.MavenCli.doMain(MavenCli.java:288)
        at org.apache.maven.cli.MavenCli.main(MavenCli.java:199)
        at sun.reflect.NativeMethodAccessorImpl.invoke0(Native Method)
        at sun.reflect.NativeMethodAccessorImpl.invoke(NativeMethodAccessorImpl.java:62)
        at sun.reflect.DelegatingMethodAccessorImpl.invoke(DelegatingMethodAccessorImpl.java:43)
        at java.lang.reflect.Method.invoke(Method.java:498)
        at org.codehaus.plexus.classworlds.launcher.Launcher.launchEnhanced(Launcher.java:289)
        at org.codehaus.plexus.classworlds.launcher.Launcher.launch(Launcher.java:229)
        at org.codehaus.plexus.classworlds.launcher.Launcher.mainWithExitCode(Launcher.java:415)
        at org.codehaus.plexus.classworlds.launcher.Launcher.main(Launcher.java:356)
[DEBUG] Executing rule: org.apache.maven.plugins.enforcer.RequireEnvironmentVariable
[DEBUG] Rule org.apache.maven.plugins.enforcer.RequireEnvironmentVariable is cacheable.
[DEBUG] Adding failure due to exception
org.apache.maven.enforcer.rule.api.EnforcerRuleException: Environment variable "JAVA_8_HOME" is required for this build.
        at org.apache.maven.plugins.enforcer.AbstractPropertyEnforcerRule.execute(AbstractPropertyEnforcerRule.java:111)
        at org.apache.maven.plugins.enforcer.EnforceMojo.execute(EnforceMojo.java:194)
        at org.apache.maven.plugin.DefaultBuildPluginManager.executeMojo(DefaultBuildPluginManager.java:134)
        at org.apache.maven.lifecycle.internal.MojoExecutor.execute(MojoExecutor.java:207)
        at org.apache.maven.lifecycle.internal.MojoExecutor.execute(MojoExecutor.java:153)
        at org.apache.maven.lifecycle.internal.MojoExecutor.execute(MojoExecutor.java:145)
        at org.apache.maven.lifecycle.internal.LifecycleModuleBuilder.buildProject(LifecycleModuleBuilder.java:116)
        at org.apache.maven.lifecycle.internal.LifecycleModuleBuilder.buildProject(LifecycleModuleBuilder.java:80)
        at org.apache.maven.lifecycle.internal.builder.singlethreaded.SingleThreadedBuilder.build(SingleThreadedBuilder.java:51)
        at org.apache.maven.lifecycle.internal.LifecycleStarter.execute(LifecycleStarter.java:128)
        at org.apache.maven.DefaultMaven.doExecute(DefaultMaven.java:307)
        at org.apache.maven.DefaultMaven.doExecute(DefaultMaven.java:193)
        at org.apache.maven.DefaultMaven.execute(DefaultMaven.java:106)
        at org.apache.maven.cli.MavenCli.execute(MavenCli.java:863)
        at org.apache.maven.cli.MavenCli.doMain(MavenCli.java:288)
        at org.apache.maven.cli.MavenCli.main(MavenCli.java:199)
        at sun.reflect.NativeMethodAccessorImpl.invoke0(Native Method)
        at sun.reflect.NativeMethodAccessorImpl.invoke(NativeMethodAccessorImpl.java:62)
        at sun.reflect.DelegatingMethodAccessorImpl.invoke(DelegatingMethodAccessorImpl.java:43)
        at java.lang.reflect.Method.invoke(Method.java:498)
        at org.codehaus.plexus.classworlds.launcher.Launcher.launchEnhanced(Launcher.java:289)
        at org.codehaus.plexus.classworlds.launcher.Launcher.launch(Launcher.java:229)
        at org.codehaus.plexus.classworlds.launcher.Launcher.mainWithExitCode(Launcher.java:415)
        at org.codehaus.plexus.classworlds.launcher.Launcher.main(Launcher.java:356)
[DEBUG] Executing rule: org.apache.maven.plugins.enforcer.RequireEnvironmentVariable
[DEBUG] Rule org.apache.maven.plugins.enforcer.RequireEnvironmentVariable is cacheable.
[DEBUG] Adding failure due to exception
org.apache.maven.enforcer.rule.api.EnforcerRuleException: Environment variable "JAVA_9_HOME" is required for this build.
        at org.apache.maven.plugins.enforcer.AbstractPropertyEnforcerRule.execute(AbstractPropertyEnforcerRule.java:111)
        at org.apache.maven.plugins.enforcer.EnforceMojo.execute(EnforceMojo.java:194)
        at org.apache.maven.plugin.DefaultBuildPluginManager.executeMojo(DefaultBuildPluginManager.java:134)
        at org.apache.maven.lifecycle.internal.MojoExecutor.execute(MojoExecutor.java:207)
        at org.apache.maven.lifecycle.internal.MojoExecutor.execute(MojoExecutor.java:153)
        at org.apache.maven.lifecycle.internal.MojoExecutor.execute(MojoExecutor.java:145)
        at org.apache.maven.lifecycle.internal.LifecycleModuleBuilder.buildProject(LifecycleModuleBuilder.java:116)
        at org.apache.maven.lifecycle.internal.LifecycleModuleBuilder.buildProject(LifecycleModuleBuilder.java:80)
        at org.apache.maven.lifecycle.internal.builder.singlethreaded.SingleThreadedBuilder.build(SingleThreadedBuilder.java:51)
        at org.apache.maven.lifecycle.internal.LifecycleStarter.execute(LifecycleStarter.java:128)
        at org.apache.maven.DefaultMaven.doExecute(DefaultMaven.java:307)
        at org.apache.maven.DefaultMaven.doExecute(DefaultMaven.java:193)
        at org.apache.maven.DefaultMaven.execute(DefaultMaven.java:106)
        at org.apache.maven.cli.MavenCli.execute(MavenCli.java:863)
        at org.apache.maven.cli.MavenCli.doMain(MavenCli.java:288)
        at org.apache.maven.cli.MavenCli.main(MavenCli.java:199)
        at sun.reflect.NativeMethodAccessorImpl.invoke0(Native Method)
        at sun.reflect.NativeMethodAccessorImpl.invoke(NativeMethodAccessorImpl.java:62)
        at sun.reflect.DelegatingMethodAccessorImpl.invoke(DelegatingMethodAccessorImpl.java:43)
        at java.lang.reflect.Method.invoke(Method.java:498)
        at org.codehaus.plexus.classworlds.launcher.Launcher.launchEnhanced(Launcher.java:289)
        at org.codehaus.plexus.classworlds.launcher.Launcher.launch(Launcher.java:229)
        at org.codehaus.plexus.classworlds.launcher.Launcher.mainWithExitCode(Launcher.java:415)
        at org.codehaus.plexus.classworlds.launcher.Launcher.main(Launcher.java:356)
[WARNING] Rule 0: org.apache.maven.plugins.enforcer.RequireMavenVersion failed with message:
Detected Maven Version: 3.3.9 is not in the allowed range 3.5.
[WARNING] Rule 3: org.apache.maven.plugins.enforcer.RequireEnvironmentVariable failed with message:
Environment variable "JAVA_6_HOME" is required for this build.
[WARNING] Rule 4: org.apache.maven.plugins.enforcer.RequireEnvironmentVariable failed with message:
Environment variable "JAVA_7_HOME" is required for this build.
[WARNING] Rule 5: org.apache.maven.plugins.enforcer.RequireEnvironmentVariable failed with message:
Environment variable "JAVA_8_HOME" is required for this build.
[WARNING] Rule 6: org.apache.maven.plugins.enforcer.RequireEnvironmentVariable failed with message:
Environment variable "JAVA_9_HOME" is required for this build.
[INFO] ------------------------------------------------------------------------
[INFO] Reactor Summary:
[INFO]
[INFO] pinpoint-hbase-distribution ........................ FAILURE [  1.157 s]
[INFO] pinpoint-hbase-schema-definition ................... SKIPPED
[INFO] pinpoint-hbase-schema .............................. SKIPPED
[INFO] pinpoint-hbase-schema-manager ...................... SKIPPED
[INFO] ------------------------------------------------------------------------
[INFO] BUILD FAILURE
[INFO] ------------------------------------------------------------------------
[INFO] Total time: 1.974 s
[INFO] Finished at: 2019-09-22T22:08:45+08:00
[INFO] Final Memory: 13M/155M
[INFO] ------------------------------------------------------------------------
[ERROR] Failed to execute goal org.apache.maven.plugins:maven-enforcer-plugin:3.0.0-M2:enforce (enforce-pinpoint-build-requirements) on project pinpoint-hbase: Some Enforcer rules have failed. Look above for specific messages explaining why the rule failed. -> [Help 1]
org.apache.maven.lifecycle.LifecycleExecutionException: Failed to execute goal org.apache.maven.plugins:maven-enforcer-plugin:3.0.0-M2:enforce (enforce-pinpoint-build-requirements) on project pinpoint-hbase: Some Enforcer rules have failed. Look above for specific messages explaining why the rule failed.
        at org.apache.maven.lifecycle.internal.MojoExecutor.execute(MojoExecutor.java:212)
        at org.apache.maven.lifecycle.internal.MojoExecutor.execute(MojoExecutor.java:153)
        at org.apache.maven.lifecycle.internal.MojoExecutor.execute(MojoExecutor.java:145)
        at org.apache.maven.lifecycle.internal.LifecycleModuleBuilder.buildProject(LifecycleModuleBuilder.java:116)
        at org.apache.maven.lifecycle.internal.LifecycleModuleBuilder.buildProject(LifecycleModuleBuilder.java:80)
        at org.apache.maven.lifecycle.internal.builder.singlethreaded.SingleThreadedBuilder.build(SingleThreadedBuilder.java:51)
        at org.apache.maven.lifecycle.internal.LifecycleStarter.execute(LifecycleStarter.java:128)
        at org.apache.maven.DefaultMaven.doExecute(DefaultMaven.java:307)
        at org.apache.maven.DefaultMaven.doExecute(DefaultMaven.java:193)
        at org.apache.maven.DefaultMaven.execute(DefaultMaven.java:106)
        at org.apache.maven.cli.MavenCli.execute(MavenCli.java:863)
        at org.apache.maven.cli.MavenCli.doMain(MavenCli.java:288)
        at org.apache.maven.cli.MavenCli.main(MavenCli.java:199)
        at sun.reflect.NativeMethodAccessorImpl.invoke0(Native Method)
        at sun.reflect.NativeMethodAccessorImpl.invoke(NativeMethodAccessorImpl.java:62)
        at sun.reflect.DelegatingMethodAccessorImpl.invoke(DelegatingMethodAccessorImpl.java:43)
        at java.lang.reflect.Method.invoke(Method.java:498)
        at org.codehaus.plexus.classworlds.launcher.Launcher.launchEnhanced(Launcher.java:289)
        at org.codehaus.plexus.classworlds.launcher.Launcher.launch(Launcher.java:229)
        at org.codehaus.plexus.classworlds.launcher.Launcher.mainWithExitCode(Launcher.java:415)
        at org.codehaus.plexus.classworlds.launcher.Launcher.main(Launcher.java:356)
Caused by: org.apache.maven.plugin.MojoExecutionException: Some Enforcer rules have failed. Look above for specific messages explaining why the rule failed.
        at org.apache.maven.plugins.enforcer.EnforceMojo.execute(EnforceMojo.java:235)
        at org.apache.maven.plugin.DefaultBuildPluginManager.executeMojo(DefaultBuildPluginManager.java:134)
        at org.apache.maven.lifecycle.internal.MojoExecutor.execute(MojoExecutor.java:207)
        ... 20 more
[ERROR]
[ERROR]
[ERROR] For more information about the errors and possible solutions, please read the following articles:
[ERROR] [Help 1] http://cwiki.apache.org/confluence/display/MAVEN/MojoExecutionException

[email protected] MINGW64 /c/Developer/pinpoint/hbase (master)
$

[email protected] MINGW64 /c/Developer/pinpoint/hbase (master)
$

 

APM监控--(四)Pinpoint扩展报警--超详细,各种问题解决之后的顺畅版本
https://blog.csdn.net/xvshu/article/details/79814549

pinpoint web报警机制源码解析
https://www.cnblogs.com/langshiquan/p/9497464.html

https://github.com/naver/pinpoint

docker 安装pinpoint
https://blog.csdn.net/qq_21816375/article/details/74898709





 

pinpoint 安装指南

标签:core   manager   enc   源码   generate   force   maven   cts   reactor   

原文地址:https://www.cnblogs.com/softidea/p/11569680.html

(0)
(0)
   
举报
评论 一句话评论(0
登录后才能评论!
© 2014 mamicode.com 版权所有 京ICP备13008772号-2
迷上了代码!